Target
Peroxisome proliferator-activated receptor delta
Ligand
BDBM50229222
Substrate
Meas. Tech.
ChEMBL_461777 (CHEMBL927783)
EC50
>10000±n/a nM
Citation
 Faucher, NMartres, PLaroze, APineau, OPotvain, FGrillot, D Design, synthesis and evaluation of trifluoromethane sulfonamide derivatives as new potent and selective peroxisome proliferator-activated receptor alpha agonists. Bioorg Med Chem Lett 18:710-5 (2008)  
Target
Name:
Peroxisome proliferator-activated receptor delta
Synonyms:
NUC1 Nuclear hormone receptor 1 PPAR-beta PPARD_MOUSE Ppard
Type:
PROTEIN
Mol. Mass.:
49719.14
Organism:
Mus musculus
Description:
ChEMBL_1288931
Residue:
440
  
Inhibitor
Name:
BDBM50229222
Synonyms:
CHEMBL253109 | N-(4-(butylsulfonamido)benzyl)-4-methyl-2-(4-(trifluoromethyl)phenyl)thiazole-5-carboxamide
Type:
Small organic molecule
Emp. Form.:
C23H24F3N3O3S2
Mol. Mass.:
511.58
SMILES:
CCCCS(=O)(=O)Nc1ccc(CNC(=O)c2sc(nc2C)-c2ccc(cc2)C(F)(F)F)cc1
: