Target
Translocator protein
Ligand
BDBM50229593
Substrate
Meas. Tech.
ChEMBL_460136 (CHEMBL924983)
Ki
1.4±n/a nM
Citation
 Briard, EZoghbi, SSImaizumi, MGourley, JPShetty, HUHong, JCropley, VFujita, MInnis, RBPike, VW Synthesis and evaluation in monkey of two sensitive 11C-labeled aryloxyanilide ligands for imaging brain peripheral benzodiazepine receptors in vivo. J Med Chem 51:17-30 (2008)  
Target
Name:
Translocator protein
Synonyms:
BZRP Mitochondrial benzodiazepine receptor PKBS Peripheral-type benzodiazepine receptor TSPO_HUMAN
Type:
Enzyme
Mol. Mass.:
18834.74
Organism:
Homo sapiens (Human)
Description:
P30536
Residue:
169
  
Inhibitor
Name:
BDBM50229593
Synonyms:
CHEMBL253596 | N-acetyl-N-(2-methoxycarbonylbenzyl)-2-phenoxyaniline
Type:
Small organic molecule
Emp. Form.:
C23H21NO4
Mol. Mass.:
375.4171
SMILES:
COC(=O)c1ccccc1CN(C(C)=O)c1ccccc1Oc1ccccc1
: