Target
Matrix metalloproteinase-9
Ligand
BDBM11868
Substrate
Meas. Tech.
ChEMBL_461866 (CHEMBL927859)
IC50
<1.5±n/a nM
Citation
 Burns, DMHe, CLi, YScherle, PLiu, XMarando, CACovington, MBYang, GPan, MTurner, SFridman, JSHollis, GVaddi, KYeleswaram, SNewton, RFriedman, SMetcalf, BYao, W Conversion of an MMP-potent scaffold to an MMP-selective HER-2 sheddase inhibitor via scaffold hybridization and subtle P1' permutations. Bioorg Med Chem Lett 18:560-4 (2008)  
Target
Name:
Matrix metalloproteinase-9
Synonyms:
67 kDa matrix metalloproteinase-9 92 kDa gelatinase CLG4B Gelatinase B MMP9 Matrix metalloproteinase 9 (MMP-9) Matrix metalloproteinase-9 (MMP9)
Type:
Enzyme
Mol. Mass.:
78452.28
Organism:
Homo sapiens (Human)
Description:
P14780
Residue:
707
  
Inhibitor
Name:
BDBM11868
Synonyms:
CHEMBL256157 N-hydroxy-4-{[(4-phenoxybenzene)sulfonyl]methyl}-1-(prop-2-yn-1-yl)piperidine-4-carboxamide hydrochloride | beta-sulfone 7e
Type:
Small organic molecule
Emp. Form.:
C22H24N2O5S
Mol. Mass.:
428.501
SMILES:
ONC(=O)C1(CS(=O)(=O)c2ccc(Oc3ccccc3)cc2)CCN(CC#C)CC1
: