Target
72 kDa type IV collagenase
Ligand
BDBM11551
Substrate
Meas. Tech.
ChEMBL_461906 (CHEMBL944753)
Ki
0.400000±n/a nM
Citation
 Yang, SMScannevin, RHWang, BBurke, SLHuang, ZKarnachi, PWilson, LJRhodes, KJLagu, BMurray, WV beta-N-Biaryl ether sulfonamide hydroxamates as potent gelatinase inhibitors: part 2. Optimization of alpha-amino substituents. Bioorg Med Chem Lett 18:1140-5 (2008)  
Target
Name:
72 kDa type IV collagenase
Synonyms:
72 kDa gelatinase CLG4A Gelatinase A (MMP-2) MMP2_HUMAN Matrix metalloproteinase-2 (MMP 2) Matrix metalloproteinases 2 (MMP-2) | TBE-1
Type:
Enzyme
Mol. Mass.:
73870.36
Organism:
Homo sapiens (Human)
Description:
P08253
Residue:
660
  
Inhibitor
Name:
BDBM11551
Synonyms:
(3R)-N-hydroxy-2-[(4-methoxy-1,1-biphenyl-4-yl)methyl]-1,2-thiazinane-3-carboxamide 1,1-dioxide CHEMBL103418 | Sultam Hydroxamate 23a
Type:
Small organic molecule
Emp. Form.:
C19H22N2O5S
Mol. Mass.:
390.453
SMILES:
COc1ccc(cc1)-c1ccc(CN2[C@H](CCCS2(=O)=O)C(=O)NO)cc1
: