Target
Transient receptor potential cation channel subfamily V member 1
Ligand
BDBM50231044
Substrate
Meas. Tech.
ChEMBL_461949 (CHEMBL945737)
IC50
44±n/a nM
Citation
 Shishido, YJinno, MIkeda, TIto, FSudo, MMakita, NOhta, AIki-Taki, AOhmi, TKanai, YTamura, TShimojo, M Synthesis of benzamide derivatives as TRPV1 antagonists. Bioorg Med Chem Lett 18:1072-8 (2008)  
Target
Name:
Transient receptor potential cation channel subfamily V member 1
Synonyms:
Capsaicin receptor TRPV1_RAT Trpv1 Vanilloid VR1 Vanilloid receptor 1 (VRI/TRPV1) Vanilloid receptor type 1-like (TrpV1/Vr1) Vr1l | osm-9-like TRP channel 1
Type:
Transient Receptor
Mol. Mass.:
94956.12
Organism:
Rattus norvegicus (rat)
Description:
O35433
Residue:
838
  
Inhibitor
Name:
BDBM50231044
Synonyms:
CHEMBL252011 | N-(2-(4,7-dihydroxynaphthalen-1-yl)propyl)-4-(trifluoromethoxy)benzamide
Type:
Small organic molecule
Emp. Form.:
C21H18F3NO4
Mol. Mass.:
405.3671
SMILES:
CC(CNC(=O)c1ccc(OC(F)(F)F)cc1)c1ccc(O)c2ccc(O)cc12
: