Target
Potassium voltage-gated channel subfamily H member 2
Ligand
BDBM50231440
Substrate
Meas. Tech.
ChEMBL_461984 (CHEMBL944827)
Ki
201±n/a nM
Citation
 Graham, JMCoughenour, LLBarr, BMRock, DLNikam, SS 1-Aminoindanes as novel motif with potential atypical antipsychotic properties. Bioorg Med Chem Lett 18:489-93 (2008)  
Target
Name:
Potassium voltage-gated channel subfamily H member 2
Synonyms:
1,3-beta-glucan synthase component GLS2 ERG Eag-related protein 1 Ether-a-go-go-related gene (HERG) Ether-a-go-go-related gene potassium channel 1 Ether-a-go-go-related gene potassium channel 1 (hERG1) Ether-a-go-go-related protein 1 H-ERG KCNH2 Potassium voltage-gated channel subfamily H member 2 (hERG) Voltage-gated potassium channel subunit Kv11.1 hERG Potassium Channel 1 | putative potassium channel subunit
Type:
Multi-pass membrane protein
Mol. Mass.:
126672.65
Organism:
Homo sapiens (Human)
Description:
Q12809
Residue:
1159
  
Inhibitor
Name:
BDBM50231440
Synonyms:
CHEMBL253878 | N-(6-(2-(4-(benzo[d]isothiazol-3-yl)piperazin-1-yl)ethyl)-2,3-dihydro-1H-inden-1-yl)-2-phenylacetamide
Type:
Small organic molecule
Emp. Form.:
C30H32N4OS
Mol. Mass.:
496.666
SMILES:
O=C(Cc1ccccc1)NC1CCc2ccc(CCN3CCN(CC3)c3nsc4ccccc34)cc12
: