Target
Beta-secretase 1
Ligand
BDBM50231941
Substrate
Meas. Tech.
ChEMBL_462111 (CHEMBL945883)
IC50
1100±n/a nM
Citation
 Ghosh, AKKumaragurubaran, NHong, LKulkarni, SXu, XMiller, HBReddy, DSWeerasena, VTurner, RChang, WKoelsch, GTang, J Potent memapsin 2 (beta-secretase) inhibitors: design, synthesis, protein-ligand X-ray structure, and in vivo evaluation. Bioorg Med Chem Lett 18:1031-6 (2008)  
Target
Name:
Beta-secretase 1
Synonyms:
ASP2 Aspartyl protease 2 BACE1 Beta-secretase (BACE) Beta-secretase 1 (BACE 1) Beta-secretase 1 (BACE1) Beta-site amyloid precursor protein cleaving enzyme 1 Memapsin-2 beta-Secretase (BACE-1) | beta-Secretase (BACE1)
Type:
Protein
Mol. Mass.:
55755.10
Organism:
Homo sapiens (Human)
Description:
P56817
Residue:
501
  
Inhibitor
Name:
BDBM50231941
Synonyms:
CHEMBL253103 | N1-((2S,3R)-3-hydroxy-4-(isopropylamino)-1-phenylbutan-2-yl)-5-(N-methylmethan-3-ylsulfonamido)-N3-((R)-1-phenylethyl)isophthalamide
Type:
Small organic molecule
Emp. Form.:
C31H40N4O5S
Mol. Mass.:
580.738
SMILES:
CC(C)NC[C@@H](O)[C@H](Cc1ccccc1)NC(=O)c1cc(cc(c1)C(=O)N[C@H](C)c1ccccc1)N(C)S(C)(=O)=O
: