Target
Cytochrome P450 3A4
Ligand
BDBM50231937
Substrate
Meas. Tech.
ChEMBL_462114 (CHEMBL944940)
IC50
696±n/a nM
Citation
 Ghosh, AKKumaragurubaran, NHong, LKulkarni, SXu, XMiller, HBReddy, DSWeerasena, VTurner, RChang, WKoelsch, GTang, J Potent memapsin 2 (beta-secretase) inhibitors: design, synthesis, protein-ligand X-ray structure, and in vivo evaluation. Bioorg Med Chem Lett 18:1031-6 (2008)  
Target
Name:
Cytochrome P450 3A4
Synonyms:
Albendazole monooxygenase CP3A4_HUMAN CYP3A4 CYPIIIA4 Cytochrome P450 3A4 (CYP3A4) Nifedipine oxidase Taurochenodeoxycholate 6-alpha-hydroxylase
Type:
Enzyme
Mol. Mass.:
57349.57
Organism:
Homo sapiens (Human)
Description:
Residue:
503
  
Inhibitor
Name:
BDBM50231937
Synonyms:
CHEMBL403268 N1-((2S,3R)-4-(3-methoxybenzylamino)-3-hydroxy-1-phenylbutan-2-yl)-5-(N-methylmethan-3-ylsulfonamido)-N3-((R)-1-phenylethyl)isophthalamide
Type:
Small organic molecule
Emp. Form.:
C36H42N4O6S
Mol. Mass.:
658.807
SMILES:
COc1cccc(CNC[C@@H](O)[C@H](Cc2ccccc2)NC(=O)c2cc(cc(c2)C(=O)N[C@H](C)c2ccccc2)N(C)S(C)(=O)=O)c1
: