Target
Mitogen-activated protein kinase 10
Ligand
BDBM50206423
Substrate
Meas. Tech.
ChEMBL_462166 (CHEMBL944994)
IC50
3500±n/a nM
Citation
 Peifer, CUrich, RSchattel, VAbadleh, MRöttig, MKohlbacher, OLaufer, S Implications for selectivity of 3,4-diarylquinolinones as p38alphaMAP kinase inhibitors. Bioorg Med Chem Lett 18:1431-5 (2008)  
Target
Name:
Mitogen-activated protein kinase 10
Synonyms:
JNK3 MAP kinase p49 3F12 MK10_HUMAN Mitogen-activated protein kinase 10 (Stress-activated protein kinase JNK3) (c-Jun N-terminal kinase 3) (MAP kinase p49 3F12) PRKM10 Stress-activated protein kinase JNK3 | c-Jun N-terminal kinase 3 (JNK3)
Type:
Enzyme
Mol. Mass.:
52586.89
Organism:
Homo sapiens (Human)
Description:
Residue:
464
  
Inhibitor
Name:
BDBM50206423
Synonyms:
4-(5-(4-fluorophenyl)-3-isopropylisoxazol-4-yl)pyridine 5-(4-fluorophenyl)-3-isopropyl-4-(pyridin-4-yl)isoxazole | CHEMBL375428
Type:
Small organic molecule
Emp. Form.:
C17H15FN2O
Mol. Mass.:
282.3122
SMILES:
CC(C)c1noc(c1-c1ccncc1)-c1ccc(F)cc1
: