Target
Cytosolic endo-beta-N-acetylglucosaminidase
Ligand
BDBM50235890
Substrate
Meas. Tech.
ChEMBL_462868 (CHEMBL928786)
IC50
750000±n/a nM
Citation
 Ohara, CTakahashi, RMiyagawa, TYoshimura, YKato, AAdachi, ITakahata, H Synthesis of all stereoisomers of 3-hydroxypipecolic acid and 3-hydroxy-4,5-dehydropipecolic acid and their evaluation as glycosidase inhibitors. Bioorg Med Chem Lett 18:1810-3 (2008)  
Target
Name:
Cytosolic endo-beta-N-acetylglucosaminidase
Synonyms:
ENASE_HUMAN Endo-beta-N-acetylglucosaminidase
Type:
PROTEIN
Mol. Mass.:
83989.32
Organism:
Homo sapiens (Human)
Description:
ChEMBL_467019
Residue:
743
  
Inhibitor
Name:
BDBM50235890
Synonyms:
(2S,3S)-3-Hydroxybaikiain CHEMBL403603
Type:
Small organic molecule
Emp. Form.:
C6H9NO3
Mol. Mass.:
143.1406
SMILES:
O[C@H]1C=CCN[C@@H]1C(O)=O
: