Target
Vascular endothelial growth factor receptor 2
Ligand
BDBM50236257
Substrate
Meas. Tech.
ChEMBL_462940 (CHEMBL929874)
IC50
4±n/a nM
Citation
 Dandu, RZulli, ALBacon, ERUnderiner, TRobinson, CChang, HMiknyoczki, SGrobelny, JRuggeri, BAYang, SAlbom, MSAngeles, TSAimone, LDHudkins, RL Design and synthesis of dihydroindazolo[5,4-a]pyrrolo[3,4-c]carbazole oximes as potent dual inhibitors of TIE-2 and VEGF-R2 receptor tyrosine kinases. Bioorg Med Chem Lett 18:1916-21 (2008)  
Target
Name:
Vascular endothelial growth factor receptor 2
Synonyms:
CD_antigen=CD309 Fetal liver kinase 1 (FLK-1) KDR Protein-tyrosine kinase receptor Flk-1 VEGFR-2 VEGFR2 Vascular Endothelial Growth Factor Receptor Kinase 2 Vascular endothelial growth factor receptor 2 (KDR) Vascular endothelial growth factor receptor 2 (VEGFR2) Vascular endothelial growth factor receptor-2 (VEGFR-2)
Type:
Receptor Tyrosine Kinase
Mol. Mass.:
151510.97
Organism:
Homo sapiens (Human)
Description:
P35968
Residue:
1356
  
Inhibitor
Name:
BDBM50236257
Synonyms:
19-methyl-3-(2-methylpropyl)-7-[(1E)-1-[(propan-2-yloxy)imino]ethyl]-3,13,19,20-tetraazahexacyclo[14.7.0.0^{2,10}.0^{4,9}.0^{11,15}.0^{17,21}]tricosa-1(16),2(10),4,6,8,11(15),17,20-octaen-14-one | CHEMBL403823
Type:
Small organic molecule
Emp. Form.:
C29H33N5O2
Mol. Mass.:
483.6046
SMILES:
CC(C)Cn1c2ccc(cc2c2c3CNC(=O)c3c3-c4cn(C)nc4CCc3c12)C(\C)=N\OC(C)C
: