Target
Vascular endothelial growth factor receptor 2
Ligand
BDBM50236267
Substrate
Meas. Tech.
ChEMBL_462939 (CHEMBL929873)
IC50
4±n/a nM
Citation
 Dandu, RZulli, ALBacon, ERUnderiner, TRobinson, CChang, HMiknyoczki, SGrobelny, JRuggeri, BAYang, SAlbom, MSAngeles, TSAimone, LDHudkins, RL Design and synthesis of dihydroindazolo[5,4-a]pyrrolo[3,4-c]carbazole oximes as potent dual inhibitors of TIE-2 and VEGF-R2 receptor tyrosine kinases. Bioorg Med Chem Lett 18:1916-21 (2008)  
Target
Name:
Vascular endothelial growth factor receptor 2
Synonyms:
CD_antigen=CD309 Fetal liver kinase 1 (FLK-1) KDR Protein-tyrosine kinase receptor Flk-1 VEGFR-2 VEGFR2 Vascular Endothelial Growth Factor Receptor Kinase 2 Vascular endothelial growth factor receptor 2 (KDR) Vascular endothelial growth factor receptor 2 (VEGFR2) Vascular endothelial growth factor receptor-2 (VEGFR-2)
Type:
Receptor Tyrosine Kinase
Mol. Mass.:
151510.97
Organism:
Homo sapiens (Human)
Description:
P35968
Residue:
1356
  
Inhibitor
Name:
BDBM50236267
Synonyms:
7-[(1E)-1-(methoxyimino)-2-methylpropyl]-19-methyl-3,13,19,20-tetraazahexacyclo[14.7.0.0^{2,10}.0^{4,9}.0^{11,15}.0^{17,21}]tricosa-1(16),2(10),4,6,8,11(15),17,20-octaen-14-one | CHEMBL257793
Type:
Small organic molecule
Emp. Form.:
C25H25N5O2
Mol. Mass.:
427.4983
SMILES:
CO\N=C(/C(C)C)c1ccc2[nH]c3c4CCc5nn(C)cc5-c4c4C(=O)NCc4c3c2c1
: