Target
1-phosphatidylinositol 4,5-bisphosphate phosphodiesterase gamma-1
Ligand
BDBM50259935
Substrate
Meas. Tech.
ChEMBL_549445 (CHEMBL1019376)
IC50
16000±n/a nM
Citation
 Lee, JSCho, YSPark, EJKim, JOh, WKLee, HSAhn, JS Phospholipase Cgamma1 inhibitory principles from the sarcotestas of Ginkgo biloba. J Nat Prod 61:867-71 (1998)  
Target
Name:
1-phosphatidylinositol 4,5-bisphosphate phosphodiesterase gamma-1
Synonyms:
1-phosphatidylinositol-4,5-bisphosphate phosphodiesterase gamma-1 Plcg1
Type:
PROTEIN
Mol. Mass.:
148532.78
Organism:
Rattus norvegicus
Description:
ChEMBL_549445
Residue:
1290
  
Inhibitor
Name:
BDBM50259935
Synonyms:
CHEMBL470544 | hispidospermidin
Type:
Small organic molecule
Emp. Form.:
C25H47N3O
Mol. Mass.:
405.6602
SMILES:
C[C@@H]1CC[C@@H]2[C@]3(C)O[C@]4(C)CC[C@]12C[C@@H]4[C@@H]3NCCCCN(C)CCCN(C)C
: