Target
Adenosine receptor A1
Ligand
BDBM22231
Substrate
Meas. Tech.
ChEMBL_528205 (CHEMBL976922)
IC50
65000±n/a nM
Citation
 Ingkaninan, Kvon Frijtag Drabbe Künzel, JKIJzerman, APVerpoorte, R Interference of linoleic acid fraction in some receptor binding assays. J Nat Prod 62:912-4 (1999)  
Target
Name:
Adenosine receptor A1
Synonyms:
AA1R_RAT ADENOSINE A1 high Adenosine A1 receptor (A1) Adenosine receptors A1 | Adora1
Type:
Protein
Mol. Mass.:
36704.13
Organism:
Rattus norvegicus (rat)
Description:
Residue:
326
  
Inhibitor
Name:
BDBM22231
Synonyms:
(9Z,12Z)-octadeca-9,12-dienoic acid Linoleic Acid | Linoleic acid (LA)
Type:
Unsaturated fatty acid
Emp. Form.:
C18H32O2
Mol. Mass.:
280.4455
SMILES:
CCCCC\C=C/C\C=C/CCCCCCCC(O)=O
: