Target
DNA polymerase beta
Ligand
BDBM50079577
Substrate
Meas. Tech.
ChEMBL_524725 (CHEMBL980280)
IC50
3700±n/a nM
Citation
 Deng, JZStarck, SRHecht, SM DNA polymerase beta inhibitors from Baeckea gunniana. J Nat Prod 62:1624-6 (2000)  
Target
Name:
DNA polymerase beta
Synonyms:
DNA Polymerase beta Polb
Type:
PROTEIN
Mol. Mass.:
38334.34
Organism:
Rattus norvegicus
Description:
ChEMBL_1361926
Residue:
335
  
Inhibitor
Name:
BDBM50079577
Synonyms:
(4aS,6aS,6bR,10S,12aR,14bS)-10-Hydroxy-2,2,6a,6b,9,9,12a-heptamethyl-1,3,4,5,6,6a,6b,7,8,8a,9,10,11,12,12a,12b,13,14b-octadecahydro-2H-picene-4a-carboxylic acid CHEMBL168 | oleanolic acid
Type:
Small organic molecule
Emp. Form.:
C30H48O3
Mol. Mass.:
456.7003
SMILES:
CC1(C)CC[C@@]2(CC[C@]3(C)C(=CCC4[C@@]5(C)CC[C@H](O)C(C)(C)C5CC[C@@]34C)[C@@H]2C1)C(O)=O
: