Target
DNA polymerase beta
Ligand
BDBM50241570
Substrate
Meas. Tech.
ChEMBL_525610 (CHEMBL972901)
Ki
2800±n/a nM
Citation
 Deng, JZStarck, SRSun, DASabat, MHecht, SM A new 7,8-euphadien-type triterpenoid from Brackenridgea nitida and Bleasdalea bleasdalei that inhibits DNA polymerase beta. J Nat Prod 63:1356-60 (2000)  
Target
Name:
DNA polymerase beta
Synonyms:
DNA Polymerase beta Polb
Type:
PROTEIN
Mol. Mass.:
38334.34
Organism:
Rattus norvegicus
Description:
ChEMBL_1361926
Residue:
335
  
Inhibitor
Name:
BDBM50241570
Synonyms:
(24E)-3beta-hydroxy-7,24-euphadien-26-oic acid | CHEMBL519411
Type:
Small organic molecule
Emp. Form.:
C31H50O3
Mol. Mass.:
470.7269
SMILES:
C[C@@H](CC\C=C(/C)C(O)=O)[C@]1(C)CC[C@]2(C)C3=CC[C@H]4C(C)(C)[C@@H](O)CC[C@]4(C)[C@H]3CC[C@@]12C
: