Target
Prostaglandin G/H synthase 2
Ligand
BDBM22231
Substrate
Meas. Tech.
ChEMBL_508956 (CHEMBL1005508)
IC50
94000±n/a nM
Citation
 Ringbom, THuss, UStenholm, AFlock, SSkattebøl, LPerera, PBohlin, L Cox-2 inhibitory effects of naturally occurring and modified fatty acids. J Nat Prod 64:745-9 (2001)  
Target
Name:
Prostaglandin G/H synthase 2
Synonyms:
COX2 Cyclooxygenase-2 (COX-2) PTGS2 Prostaglandin G/H synthase (cyclooxygenase)
Type:
Protein
Mol. Mass.:
68976.98
Organism:
Ovis aries (Sheep)
Description:
Residue:
603
  
Inhibitor
Name:
BDBM22231
Synonyms:
(9Z,12Z)-octadeca-9,12-dienoic acid Linoleic Acid | Linoleic acid (LA)
Type:
Unsaturated fatty acid
Emp. Form.:
C18H32O2
Mol. Mass.:
280.4455
SMILES:
CCCCC\C=C/C\C=C/CCCCCCCC(O)=O
: