Target
Deoxyribonuclease-2-alpha
Ligand
BDBM50242374
Substrate
Meas. Tech.
ChEMBL_509270 (CHEMBL996014)
IC50
>250000±n/a nM
Citation
 Suzuki, KYahara, SMaehata, KUyeda, M Isoaurostatin, a novel topoisomerase inhibitor produced by Thermomonospora alba. J Nat Prod 64:204-7 (2001)  
Target
Name:
Deoxyribonuclease-2-alpha
Synonyms:
DNASE2 DNL2 | DNS2A_PIG
Type:
PROTEIN
Mol. Mass.:
40189.42
Organism:
Sus scrofa
Description:
ChEMBL_509270
Residue:
364
  
Inhibitor
Name:
BDBM50242374
Synonyms:
CHEMBL505529 | topostatin
Type:
Small organic molecule
Emp. Form.:
C36H58N4O11S
Mol. Mass.:
754.931
SMILES:
CCCCCCCC(C)CC=C(C)C=CC(=O)C(C)CCC1OC(=O)[C@H](CC(OS(O)(=O)=O)C(N)=O)NC(=O)[C@@H](C)CNC(=O)C(=C)NC(=O)C1C
: