Target
Type II restriction enzyme ScaI
Ligand
BDBM50242374
Substrate
Meas. Tech.
ChEMBL_504717 (CHEMBL990277)
IC50
7000±n/a nM
Citation
 Suzuki, KYahara, SMaehata, KUyeda, M Isoaurostatin, a novel topoisomerase inhibitor produced by Thermomonospora alba. J Nat Prod 64:204-7 (2001)  
Target
Name:
Type II restriction enzyme ScaI
Synonyms:
T2S1_STRCS scaIR
Type:
PROTEIN
Mol. Mass.:
25466.25
Organism:
Streptomyces caespitosus
Description:
ChEMBL_504717
Residue:
227
  
Inhibitor
Name:
BDBM50242374
Synonyms:
CHEMBL505529 | topostatin
Type:
Small organic molecule
Emp. Form.:
C36H58N4O11S
Mol. Mass.:
754.931
SMILES:
CCCCCCCC(C)CC=C(C)C=CC(=O)C(C)CCC1OC(=O)[C@H](CC(OS(O)(=O)=O)C(N)=O)NC(=O)[C@@H](C)CNC(=O)C(=C)NC(=O)C1C
: