Target
Beta-mannosidase
Ligand
BDBM50279406
Substrate
Meas. Tech.
ChEMBL_545876 (CHEMBL1034391)
IC50
53000±n/a nM
Citation
 Yamashita, TYasuda, KKizu, HKameda, YWatson, AANash, RJFleet, GWAsano, N New polyhydroxylated pyrrolidine, piperidine, and pyrrolizidine alkaloids from Scilla sibirica. J Nat Prod 65:1875-81 (2002)  
Target
Name:
Beta-mannosidase
Synonyms:
MANBA_RAT | Manba
Type:
PROTEIN
Mol. Mass.:
101229.60
Organism:
Rattus norvegicus
Description:
ChEMBL_41368
Residue:
881
  
Inhibitor
Name:
BDBM50279406
Synonyms:
2,5-Dideoxy-2,5-imino-glycero-D-manno-heptitol | CHEMBL488156
Type:
Small organic molecule
Emp. Form.:
C7H15NO5
Mol. Mass.:
193.1977
SMILES:
OC[C@H](O)[C@H]1N[C@H](CO)[C@@H](O)[C@@H]1O
: