Target
Type II restriction enzyme EcoRI
Ligand
BDBM50250728
Substrate
Meas. Tech.
ChEMBL_504581 (CHEMBL993793)
IC50
>50000±n/a nM
Citation
 Singh, SBOndeyka, JGSchleif, WAFelock, PHazuda, DJ Chemistry and structure-activity relationship of HIV-1 integrase inhibitor integracide B and related natural products. J Nat Prod 66:1338-44 (2003)  
Target
Name:
Type II restriction enzyme EcoRI
Synonyms:
T2E1_ECOLX ecoRIR
Type:
PROTEIN
Mol. Mass.:
31063.04
Organism:
Escherichia coli
Description:
ChEMBL_504581
Residue:
277
  
Inhibitor
Name:
BDBM50250728
Synonyms:
(2R,3R,5R,10S,15S,17R)-15-methoxy-4,4,10,12-tetramethyl-17-((R)-6-methyl-5-methyleneheptan-2-yl)-2,3,4,5,6,7,10,15,16,17-decahydro-1H-cyclopenta[a]phenanthrene-2,3-diol | CHEMBL468450
Type:
Small organic molecule
Emp. Form.:
C31H48O3
Mol. Mass.:
468.711
SMILES:
CO[C@H]1C[C@H]([C@H](C)CCC(=C)C(C)C)c2c1c1CC[C@H]3C(C)(C)[C@@H](O)[C@H](O)C[C@]3(C)c1cc2C
: