Target
DNA polymerase beta
Ligand
BDBM50148911
Substrate
Meas. Tech.
ChEMBL_550647 (CHEMBL1002742)
IC50
18600±n/a nM
Citation
 Chaturvedula, VSGao, ZJones, SHFeng, XHecht, SMKingston, DG A new ursane triterpene from Monochaetum vulcanicum that inhibits DNA polymerase beta lyase. J Nat Prod 67:899-901 (2004)  
Target
Name:
DNA polymerase beta
Synonyms:
DNA polymerase beta (Pol β) POLB
Type:
Protein
Mol. Mass.:
38188.76
Organism:
Homo sapiens (Human)
Description:
Residue:
335
  
Inhibitor
Name:
BDBM50148911
Synonyms:
(3beta)-3-hydroxyurs-12-en-28-oic acid CHEMBL169 malol urson
Type:
Small organic molecule
Emp. Form.:
C30H48O3
Mol. Mass.:
456.7003
SMILES:
C[C@@H]1CC[C@@]2(CC[C@]3(C)C(=CC[C@@H]4[C@@]5(C)CC[C@H](O)C(C)(C)[C@@H]5CC[C@@]34C)[C@@H]2[C@H]1C)C(O)=O
: