Target
Glucagon receptor
Ligand
BDBM50269746
Substrate
Meas. Tech.
ChEMBL_481288 (CHEMBL998398)
IC50
320±n/a nM
Citation
 Potterat, OWagner, KGemmecker, GMack, JPuder, CVettermann, RStreicher, R BI-32169, a bicyclic 19-peptide with strong glucagon receptor antagonist activity from Streptomyces sp. J Nat Prod 67:1528-31 (2004)  
Target
Name:
Glucagon receptor
Synonyms:
GCGR GLR_HUMAN Glucagon receptor (GlucR)
Type:
Enzyme
Mol. Mass.:
54026.92
Organism:
Homo sapiens (Human)
Description:
P47871
Residue:
477
  
Inhibitor
Name:
BDBM50269746
Synonyms:
CHEMBL524883 | methyl (1S,5S,11S,17S,20S,23S,29S,32S,35S,38R,43R,49S,52S,58S,66S,69S)-5-[(2S)-butan-2-yl]-20-(carbamoylmethyl)-23-[(1R)-1-hydroxyethyl]-66-(hydroxymethyl)-17,32,49-tris(1H-indol-3-ylmethyl)-35-methyl-58-(2-methylpropyl)-3,6,12,15,18,21,24,30,33,36,45,48,51,57,60,63,65,68,74-nonadecaoxo-40,41-dithia-4,7,13,16,19,22,25,31,34,37,44,47,50,56,59,62,64,67,73-nonadecaazahexacyclo[41.20.11.0^{7,11}.0^{25,29}.0^{52,56}.0^{69,73}]tetraheptacontane-38-carboxylate
Type:
Small organic molecule
Emp. Form.:
C96H127N23O24S2
Mol. Mass.:
2051.305
SMILES:
CC[C@H](C)[C@@H]1NC(=O)C[C@@H]2NC(=O)[C@H](CO)NC(=O)[C@@H]3CCCN3C(=O)[C@H](CSSC[C@H](NC(=O)[C@H](C)NC(=O)[C@H](Cc3c[nH]c4ccccc34)NC(=O)[C@@H]3CCCN3C(=O)[C@@H](NC(=O)[C@H](CC(N)=O)NC(=O)[C@H](Cc3c[nH]c4ccccc34)NC(=O)CNC(=O)[C@@H]3CCCN3C1=O)[C@@H](C)O)C(=O)OC)NC(=O)CNC(=O)[C@H](Cc1c[nH]c3ccccc13)NC(=O)[C@@H]1CCCN1C(=O)[C@H](CC(C)C)NC(=O)CNC2=O
: