Target
Aromatase
Ligand
BDBM22319
Substrate
Meas. Tech.
ChEMBL_524646 (CHEMBL976710)
IC50
28200±n/a nM
Citation
 Balunas, MJSu, BLandini, SBrueggemeier, RWKinghorn, AD Interference by naturally occurring fatty acids in a noncellular enzyme-based aromatase bioassay. J Nat Prod 69:700-3 (2006)  
Target
Name:
Aromatase
Synonyms:
ARO1 CP19A_HUMAN CYP19 CYPXIX Cytochrome P450 19A1 Cytochrome P450-C19 (CYP19) FL cytokine receptor precursor | P-450AROM
Type:
Enzyme
Mol. Mass.:
57888.92
Organism:
Homo sapiens (Human)
Description:
P11511
Residue:
503
  
Inhibitor
Name:
BDBM22319
Synonyms:
(5Z,8Z,11Z,14Z)-icosa-5,8,11,14-tetraenoic acid Arachidonic acid (AA) [1-14C]Arachidonic acid
Type:
Unsaturated fatty acid
Emp. Form.:
C20H32O2
Mol. Mass.:
304.4669
SMILES:
CCCCC\C=C/C\C=C/C\C=C/C\C=C/CCCC(O)=O
: