Target
Aromatase
Ligand
BDBM22231
Substrate
Meas. Tech.
ChEMBL_524646 (CHEMBL976710)
IC50
48000±n/a nM
Citation
 Balunas, MJSu, BLandini, SBrueggemeier, RWKinghorn, AD Interference by naturally occurring fatty acids in a noncellular enzyme-based aromatase bioassay. J Nat Prod 69:700-3 (2006)  
Target
Name:
Aromatase
Synonyms:
ARO1 CP19A_HUMAN CYP19 CYPXIX Cytochrome P450 19A1 Cytochrome P450-C19 (CYP19) FL cytokine receptor precursor | P-450AROM
Type:
Enzyme
Mol. Mass.:
57888.92
Organism:
Homo sapiens (Human)
Description:
P11511
Residue:
503
  
Inhibitor
Name:
BDBM22231
Synonyms:
(9Z,12Z)-octadeca-9,12-dienoic acid Linoleic Acid | Linoleic acid (LA)
Type:
Unsaturated fatty acid
Emp. Form.:
C18H32O2
Mol. Mass.:
280.4455
SMILES:
CCCCC\C=C/C\C=C/CCCCCCCC(O)=O
: