Target
Kappa-type opioid receptor
Ligand
BDBM50159165
Substrate
Meas. Tech.
ChEMBL_525306 (CHEMBL968095)
Ki
1.9±n/a nM
Citation
 Tidgewell, KHarding, WWLozama, ACobb, HShah, KKannan, PDersch, CMParrish, DDeschamps, JRRothman, RBPrisinzano, TE Synthesis of salvinorin A analogues as opioid receptor probes. J Nat Prod 69:914-8 (2006)  
Target
Name:
Kappa-type opioid receptor
Synonyms:
K-OR-1 Kappa-opioid receptor (KOR) Kappa-type opioid receptor (KOR) OPIATE Kappa OPRK1 kappa opioid receptor (KOR)
Type:
G Protein-Coupled Receptor (GPCR)
Mol. Mass.:
42648.76
Organism:
Homo sapiens (Human)
Description:
P41145
Residue:
380
  
Inhibitor
Name:
BDBM50159165
Synonyms:
(2S,4aR,6aR,7R,9S,10aS,10bR)-9-(acetyloxy)-2-(furan-3-yl)dodecahydro-6a,10b-dimethyl-4,10-dioxo-2H-naphtho-[2,1-c]pyran-7-carboxylic acid methyl ester (2S,4aR,6aR,7R,9S,10aS,10bR)-methyl 9-acetoxy-2-(furan-3-yl)-6a,10b-dimethyl-4,10-dioxo-dodecahydro-1H-benzo[f]isochromene-7-carboxylate 2S,4aR,6a(R,7R,9S,10aS,10bR)-9-(acetyloxy)-2-(furan-3-yl)dodecahydro-6a,10b-dimethyl-4,10-dioxo-2H-naphtho[2,1-c]pyran-7-carboxylic acid methyl ester Salvinorin A salvinorin-A
Type:
Small organic molecule
Emp. Form.:
C23H28O8
Mol. Mass.:
432.4636
SMILES:
COC(=O)[C@@H]1C[C@H](OC(C)=O)C(=O)[C@H]2[C@@]1(C)CC[C@H]1C(=O)O[C@@H](C[C@]21C)c1ccoc1
: