Target
Neuronal acetylcholine receptor subunit alpha-3
Ligand
BDBM50241748
Substrate
Meas. Tech.
ChEMBL_527213 (CHEMBL972002)
IC50
100000±n/a nM
Citation
 Freyer, AJHuffman, JMenachery, MDHuey, KLeavens, WJFitch, RW Isolation, structure elucidation, and biological evaluation of 15-amido-3-demethoxy-2alpha,3alpha-methylenedioxyerythroculine, a new alkaloid from Hyperbaena valida. J Nat Prod 69:1514-6 (2006)  
Target
Name:
Neuronal acetylcholine receptor subunit alpha-3
Synonyms:
ACHA3_RAT Chrna3
Type:
Enzyme
Mol. Mass.:
56995.52
Organism:
Rattus norvegicus (Rat)
Description:
P04757
Residue:
499
  
Inhibitor
Name:
BDBM50241748
Synonyms:
CHEMBL518059 | dihydro-beta-erythroidine
Type:
Small organic molecule
Emp. Form.:
C16H21NO3
Mol. Mass.:
275.3428
SMILES:
CO[C@H]1CC=C2CCN3CCC4=C(CC(=O)OC4)[C@@]23C1
: