Target
Botulinum neurotoxin type A
Ligand
BDBM50240901
Substrate
Meas. Tech.
ChEMBL_508387 (CHEMBL1008251)
Ki
6000±n/a nM
Citation
 Burnett, JCRuthel, GStegmann, CMPanchal, RGNguyen, TLHermone, ARStafford, RGLane, DJKenny, TAMcGrath, CFWipf, PStahl, AMSchmidt, JJGussio, RBrunger, ATBavari, S Inhibition of metalloprotease botulinum serotype A from a pseudo-peptide binding mode to a small molecule that is active in primary neurons. J Biol Chem 282:5004-14 (2007)  
Target
Name:
Botulinum neurotoxin type A
Synonyms:
BXA1_CLOBH bna | botA
Type:
PROTEIN
Mol. Mass.:
149421.96
Organism:
Clostridium botulinum (strain Hall / ATCC 3502 / NCTC 13319 / Type A)
Description:
ChEMBL_987932
Residue:
1296
  
Inhibitor
Name:
BDBM50240901
Synonyms:
2-((1E,3E,5E)-6-{5-[(E)-amino(imino)methyl]-1-benzofuran-2-yl}hexa-1,3,5-trienyl)-1-benzofuran-5-carboximidamide CHEMBL164581 | NSC-308574
Type:
Small organic molecule
Emp. Form.:
C24H20N4O2
Mol. Mass.:
396.4412
SMILES:
NC(=N)c1ccc2oc(\C=C\C=C\C=C\c3cc4cc(ccc4o3)C(N)=N)cc2c1
: