Target
Parathyroid hormone/parathyroid hormone-related peptide receptor
Ligand
BDBM50269972
Substrate
Meas. Tech.
ChEMBL_505700 (CHEMBL944462)
EC50
53±n/a nM
Citation
 Carter, PHLiu, RQFoster, WRTamasi, JATebben, AJFavata, MStaal, ACvijic, MEFrench, MHDell, VApanovitch, DLei, MZhao, QCunningham, MDecicco, CPTrzaskos, JMFeyen, JH Discovery of a small molecule antagonist of the parathyroid hormone receptor by using an N-terminal parathyroid hormone peptide probe. Proc Natl Acad Sci U S A 104:6846-51 (2007)  
Target
Name:
Parathyroid hormone/parathyroid hormone-related peptide receptor
Synonyms:
PTH/PTHr receptor PTH1 receptor PTH1R_HUMAN PTHR1 Parathyroid hormone receptor
Type:
Enzyme Catalytic Domain
Mol. Mass.:
66370.95
Organism:
Homo sapiens (Human)
Description:
PARATHYROID HT1 0 HUMAN::Q03431
Residue:
593
  
Inhibitor
Name:
BDBM50269972
Synonyms:
Ala-Val-Ala-Glu-lle-Gln-Leu-Met-His-Gln-Har-Ala-Lys-Trp-Fly | CHEMBL505612
Type:
Small organic molecule
Emp. Form.:
C102H146N26O23S
Mol. Mass.:
2136.476
SMILES:
CC[C@H](C)[C@H](NC(=O)[C@H](CCC(O)=O)NC(=O)[C@H](C)NC(=O)[C@@H](NC(=O)[C@H](C)N)C(C)C)C(=O)N[C@@H](CCC(N)=O)C(=O)N[C@@H](CC(C)C)C(=O)N[C@@H](CCSC)C(=O)N[C@@H](Cc1cnc[nH]1)C(=O)N[C@@H](CCC(N)=O)C(=O)N[C@@H](CCCCN=C(N)N)C(=O)N[C@@H](C)C(=O)N[C@@H](CCCCN)C(=O)N[C@@H](Cc1c[nH]c2ccccc12)C(=O)N[C@@H](CCCCNC(=O)c1ccccc1-c1c2ccc(O)cc2oc2cc(=O)ccc12)C(N)=O
: