Target
Serine/threonine-protein kinase Chk1
Ligand
BDBM50216157
Substrate
Meas. Tech.
ChEMBL_530558 (CHEMBL968469)
IC50
440±n/a nM
Citation
 Conchon, EAnizon, FAboab, BGolsteyn, RMLéonce, SPfeiffer, BPrudhomme, M Synthesis, in vitro antiproliferative activities, and Chk1 inhibitory properties of pyrrolo[3,4-a]carbazole-1,3-diones, pyrrolo[3,4-c]carbazole-1,3-diones, and 2-aminopyridazino[3,4-a]pyrrolo[3,4-c]carbazole-1,3,4,7-tetraone. Eur J Med Chem 43:282-92 (2008)  
Target
Name:
Serine/threonine-protein kinase Chk1
Synonyms:
CHEK1 CHK1 checkpoint homolog Checkpoint kinase-1 (CHK1)
Type:
Enzyme Catalytic Domain
Mol. Mass.:
54443.02
Organism:
Homo sapiens (Human)
Description:
gi_166295192
Residue:
476
  
Inhibitor
Name:
BDBM50216157
Synonyms:
11H-2,5,11,11b-Tetraaza-benzo[a]trindene-4,6-dione CHEMBL413188 | isogranulatimide
Type:
Small organic molecule
Emp. Form.:
C15H8N4O2
Mol. Mass.:
276.2496
SMILES:
O=C1NC(=O)c2c1c1cncn1c1[nH]c3ccccc3c21
: