Target
Proprotein convertase subtilisin/kexin type 4
Ligand
BDBM50269901
Substrate
Meas. Tech.
ChEMBL_508165 (CHEMBL1008223)
Ki
562±n/a nM
Citation
 Shiryaev, SARemacle, AGRatnikov, BINelson, NASavinov, AYWei, GBottini, MRega, MFParent, ADesjardins, RFugere, MDay, RSabet, MPellecchia, MLiddington, RCSmith, JWMustelin, TGuiney, DGLebl, MStrongin, AY Targeting host cell furin proprotein convertases as a therapeutic strategy against bacterial toxins and viral pathogens. J Biol Chem 282:20847-53 (2007)  
Target
Name:
Proprotein convertase subtilisin/kexin type 4
Synonyms:
PC4 PCSK4_HUMAN Proprotein convertase subtilisin/kexin type 4 | Subtilisin/kexin type 4
Type:
PROTEIN
Mol. Mass.:
82817.14
Organism:
Homo sapiens (Human)
Description:
ChEMBL_508165
Residue:
755
  
Inhibitor
Name:
BDBM50269901
Synonyms:
CHEMBL525748 | TPRARRRKKRI
Type:
Small organic molecule
Emp. Form.:
C60H117N29O12
Mol. Mass.:
1436.7581
SMILES:
[#6]-[#6]-[#6@H](-[#6])-[#6@H](-[#7]-[#6](=O)-[#6@H](-[#6]-[#6]-[#6]\[#7]=[#6](/[#7])-[#7])-[#7]-[#6](=O)-[#6@H](-[#6]-[#6]-[#6]-[#6]-[#7])-[#7]-[#6](=O)-[#6@H](-[#6]-[#6]-[#6]-[#6]-[#7])-[#7]-[#6](=O)-[#6@H](-[#6]-[#6]-[#6]\[#7]=[#6](/[#7])-[#7])-[#7]-[#6](=O)-[#6@H](-[#6]-[#6]-[#6]\[#7]=[#6](/[#7])-[#7])-[#7]-[#6](=O)-[#6@H](-[#6]-[#6]-[#6]\[#7]=[#6](/[#7])-[#7])-[#7]-[#6](=O)-[#6@H](-[#6])-[#7]-[#6](=O)-[#6@H](-[#6]-[#6]-[#6]\[#7]=[#6](/[#7])-[#7])-[#7]-[#6](=O)-[#6@@H]-1-[#6]-[#6]-[#6]-[#7]-1-[#6](=O)-[#6@@H](-[#7])-[#6@@H](-[#6])-[#8])-[#6](-[#7])=O
: