Target
Proprotein convertase subtilisin/kexin type 7
Ligand
BDBM50269901
Substrate
Meas. Tech.
ChEMBL_508167 (CHEMBL1008225)
Ki
135±n/a nM
Citation
 Shiryaev, SARemacle, AGRatnikov, BINelson, NASavinov, AYWei, GBottini, MRega, MFParent, ADesjardins, RFugere, MDay, RSabet, MPellecchia, MLiddington, RCSmith, JWMustelin, TGuiney, DGLebl, MStrongin, AY Targeting host cell furin proprotein convertases as a therapeutic strategy against bacterial toxins and viral pathogens. J Biol Chem 282:20847-53 (2007)  
Target
Name:
Proprotein convertase subtilisin/kexin type 7
Synonyms:
LPC PC7 PCSK7 Prohormone convertase PC7 Proprotein convertase subtilisin/kexin type 7 Subtilisin/kexin type 7 hPC8
Type:
PROTEIN
Mol. Mass.:
86233.43
Organism:
Homo sapiens (Human)
Description:
ChEMBL_1290739
Residue:
785
  
Inhibitor
Name:
BDBM50269901
Synonyms:
CHEMBL525748 | TPRARRRKKRI
Type:
Small organic molecule
Emp. Form.:
C60H117N29O12
Mol. Mass.:
1436.7581
SMILES:
[#6]-[#6]-[#6@H](-[#6])-[#6@H](-[#7]-[#6](=O)-[#6@H](-[#6]-[#6]-[#6]\[#7]=[#6](/[#7])-[#7])-[#7]-[#6](=O)-[#6@H](-[#6]-[#6]-[#6]-[#6]-[#7])-[#7]-[#6](=O)-[#6@H](-[#6]-[#6]-[#6]-[#6]-[#7])-[#7]-[#6](=O)-[#6@H](-[#6]-[#6]-[#6]\[#7]=[#6](/[#7])-[#7])-[#7]-[#6](=O)-[#6@H](-[#6]-[#6]-[#6]\[#7]=[#6](/[#7])-[#7])-[#7]-[#6](=O)-[#6@H](-[#6]-[#6]-[#6]\[#7]=[#6](/[#7])-[#7])-[#7]-[#6](=O)-[#6@H](-[#6])-[#7]-[#6](=O)-[#6@H](-[#6]-[#6]-[#6]\[#7]=[#6](/[#7])-[#7])-[#7]-[#6](=O)-[#6@@H]-1-[#6]-[#6]-[#6]-[#7]-1-[#6](=O)-[#6@@H](-[#7])-[#6@@H](-[#6])-[#8])-[#6](-[#7])=O
: