Target
C-X-C chemokine receptor type 4
Ligand
BDBM50035719
Substrate
Meas. Tech.
ChEMBL_506040 (CHEMBL950635)
Ki
20000±n/a nM
Citation
 Rosenkilde, MMGerlach, LOHatse, SSkerlj, RTSchols, DBridger, GJSchwartz, TW Molecular mechanism of action of monocyclam versus bicyclam non-peptide antagonists in the CXCR4 chemokine receptor. J Biol Chem 282:27354-65 (2007)  
Target
Name:
C-X-C chemokine receptor type 4
Synonyms:
C-X-C chemokine receptor type 4 CD_antigen=CD184 CXCR-4 CXCR4_HUMAN Fusin LCR1 Leukocyte-derived seven transmembrane domain receptor SDF-1 receptor | Stromal cell-derived factor 1 receptor
Type:
Enzyme
Mol. Mass.:
39754.61
Organism:
Homo sapiens (Human)
Description:
P61073
Residue:
352
  
Inhibitor
Name:
BDBM50035719
Synonyms:
1-(4-Methyl-benzyl)-1,4,8,11tetraaza-cyclotetradecane | CHEMBL122226
Type:
Small organic molecule
Emp. Form.:
C18H32N4
Mol. Mass.:
304.4735
SMILES:
Cc1ccc(CN2CCCNCCNCCCNCC2)cc1
: