Target
Matrix metalloproteinase-17
Ligand
BDBM50062351
Substrate
Meas. Tech.
ChEMBL_507879 (CHEMBL952576)
IC50
3.4±n/a nM
Citation
 Johnson, ARPavlovsky, AGOrtwine, DFPrior, FMan, CFBornemeier, DABanotai, CAMueller, WTMcConnell, PYan, CBaragi, VLesch, CRoark, WHWilson, MDatta, KGuzman, RHan, HKDyer, RD Discovery and characterization of a novel inhibitor of matrix metalloprotease-13 that reduces cartilage damage in vivo without joint fibroplasia side effects. J Biol Chem 282:27781-91 (2007)  
Target
Name:
Matrix metalloproteinase-17
Synonyms:
MMP-17 MMP17_HUMAN MT4-MMP MTMMP4 Matrix metalloproteinase-17 Membrane-type-4 matrix metalloproteinase
Type:
PROTEIN
Mol. Mass.:
66652.56
Organism:
Homo sapiens (Human)
Description:
ChEMBL_1433225
Residue:
603
  
Inhibitor
Name:
BDBM50062351
Synonyms:
(R)-N*4*-Hydroxy-N*1*-[(S)-2-(1H-indol-3-yl)-1-methylcarbamoyl-ethyl]-2-isobutyl-succinamide (R)-N1-((S)-3-(1H-indol-3-yl)-1-(methylamino)-1-oxopropan-2-yl)-N4-hydroxy-2-isobutylsuccinamide CHEMBL19611 US9487462, ilomastat
Type:
Small organic molecule
Emp. Form.:
C20H28N4O4
Mol. Mass.:
388.4607
SMILES:
CNC(=O)[C@H](Cc1c[nH]c2ccccc12)NC(=O)[C@H](CC(C)C)CC(=O)NO
: