Target
Gamma-aminobutyric acid receptor subunit alpha-1
Ligand
BDBM50242613
Substrate
Meas. Tech.
ChEMBL_507907 (CHEMBL952528)
Kd
878±n/a nM
Citation
 Tan, KRGonthier, ABaur, RErnst, MGoeldner, MSigel, E Proximity-accelerated chemical coupling reaction in the benzodiazepine-binding site of gamma-aminobutyric acid type A receptors: superposition of different allosteric modulators. J Biol Chem 282:26316-25 (2007)  
Target
Name:
Gamma-aminobutyric acid receptor subunit alpha-1
Synonyms:
Benzodiazepine central GABA A Benzodiazepine liver GABA(A) receptor subunit alpha-1 GABA-A receptor GBRA1_HUMAN TBPS | agonist GABA site
Type:
Protein
Mol. Mass.:
51817.35
Organism:
Homo sapiens (Human)
Description:
P14867
Residue:
456
  
Inhibitor
Name:
BDBM50242613
Synonyms:
8-Isothiocyanato-5-methyl-6-oxo-5,6-dihydro-4H-2,5,10b-triaza-benzo[e]azulene-3-carboxylic acid ethyl ester | CHEMBL485829
Type:
Small organic molecule
Emp. Form.:
C16H14N4O3S
Mol. Mass.:
342.372
SMILES:
CCOC(=O)c1ncn-2c1CN(C)C(=O)c1cc(ccc-21)N=C=S
: