Target
Cyclin-dependent kinase 2
Ligand
BDBM8364
Substrate
Meas. Tech.
ChEMBL_510894 (CHEMBL997786)
IC50
2±n/a nM
Citation
 Patel, DSBharatam, PV Selectivity criterion for pyrazolo[3,4-b]pyrid[az]ine derivatives as GSK-3 inhibitors: CoMFA and molecular docking studies. Eur J Med Chem 43:949-57 (2008)  
Target
Name:
Cyclin-dependent kinase 2
Synonyms:
CDK2 CDK2_HUMAN Cell division protein kinase 2 Protein cereblon/Cyclin-dependent kinase 2 | p33 protein kinase
Type:
Enzyme Subunit
Mol. Mass.:
33938.17
Organism:
Homo sapiens (Human)
Description:
P24941
Residue:
298
  
Inhibitor
Name:
BDBM8364
Synonyms:
CHEMBL260416 pyrazolo[3,4-b]pyridine analogue 6
Type:
Small organic molecule
Emp. Form.:
C16H13BrN4O2
Mol. Mass.:
373.204
SMILES:
Oc1ccc(cc1Br)-c1ccc2c(NC(=O)C3CC3)n[nH]c2n1
: