Target
Squalene synthase
Ligand
BDBM50269921
Substrate
Meas. Tech.
ChEMBL_520603 (CHEMBL959525)
IC50
970±n/a nM
Citation
 Cammerer, SBJimenez, CJones, SGros, LLorente, SORodrigues, CRodrigues, JCCaldera, ARuiz Perez, LMda Souza, WKaiser, MBrun, RUrbina, JAGonzalez Pacanowska, DGilbert, IH Quinuclidine derivatives as potential antiparasitics. Antimicrob Agents Chemother 51:4049-61 (2007)  
Target
Name:
Squalene synthase
Synonyms:
Farnesyltransferase, putative
Type:
PROTEIN
Mol. Mass.:
47117.40
Organism:
Leishmania major
Description:
ChEMBL_520603
Residue:
414
  
Inhibitor
Name:
BDBM50269921
Synonyms:
3-[1'-{2'-(4''-Ethyl ethanoatephenyl)-ethynyl]-3-quinuclidinol | CHEMBL478348
Type:
Small organic molecule
Emp. Form.:
C19H23NO3
Mol. Mass.:
313.3908
SMILES:
CCOC(=O)Cc1ccc(cc1)C#CC1(O)CN2CCC1CC2
: