Target
Prostaglandin G/H synthase 2
Ligand
BDBM50272124
Substrate
Meas. Tech.
ChEMBL_510899 (CHEMBL997791)
IC50
0.37±n/a nM
Citation
 Gupta, AKGupta, RASoni, LKKaskhedikar, SG Exploration of physicochemical properties and molecular modelling studies of 2-sulfonyl-phenyl-3-phenyl-indole analogs as cyclooxygenase-2 inhibitors. Eur J Med Chem 43:1297-303 (2008)  
Target
Name:
Prostaglandin G/H synthase 2
Synonyms:
COX2 Cyclooxygenase 2 (COX-2) Cyclooxygenase-2 (COX-2 AA) Cyclooxygenase-2 (COX-2) PGH2_HUMAN PHS II Prostaglandin E synthase/G/H synthase 2 Prostaglandin-endoperoxide synthase 2
Type:
Enzyme
Mol. Mass.:
69003.89
Organism:
Homo sapiens (Human)
Description:
Recombinant Cox-2 provided by Cayman (Cayman Chemical Co.,Ann Arbor, MI).
Residue:
604
  
Inhibitor
Name:
BDBM50272124
Synonyms:
3-(4-bromophenyl)-2-(4-(methylsulfonyl)phenyl)-1H-indole | CHEMBL502554
Type:
Small organic molecule
Emp. Form.:
C21H16BrNO2S
Mol. Mass.:
426.326
SMILES:
CS(=O)(=O)c1ccc(cc1)-c1[nH]c2ccccc2c1-c1ccc(Br)cc1
: