Target
Sodium channel protein type 3 subunit alpha
Ligand
BDBM50242400
Substrate
Meas. Tech.
ChEMBL_534117 (CHEMBL985174)
IC50
8000±n/a nM
Citation
 Zhang, MMGreen, BRCatlin, PFiedler, BAzam, LChadwick, ATerlau, HMcArthur, JRFrench, RJGulyas, JRivier, JESmith, BJNorton, RSOlivera, BMYoshikami, DBulaj, G Structure/function characterization of micro-conotoxin KIIIA, an analgesic, nearly irreversible blocker of mammalian neuronal sodium channels. J Biol Chem 282:30699-706 (2007)  
Target
Name:
Sodium channel protein type 3 subunit alpha
Synonyms:
SCN3A_RAT Sodium channel protein type 3 subunit alpha Sodium channel protein type III subunit alpha Voltage-gated sodium channel Voltage-gated sodium channel subunit alpha Nav1.3
Type:
PROTEIN
Mol. Mass.:
221371.72
Organism:
Rattus norvegicus
Description:
ChEMBL_1516894
Residue:
1951
  
Inhibitor
Name:
BDBM50242400
Synonyms:
CCNCSSKWCRDHSRCC | CHEMBL525818
Type:
Small organic molecule
Emp. Form.:
C70H106N28O22S6
Mol. Mass.:
1884.155
SMILES:
NCCCC[C@@H]1NC(=O)[C@H](CO)NC(=O)[C@H](CO)NC(=O)[C@@H]2CSSC[C@H](NC(=O)[C@@H]3CSSC[C@H](NC(=O)[C@@H](N)CSSC[C@H](NC(=O)[C@H](Cc4c[nH]c5ccccc45)NC1=O)C(=O)N[C@@H](CCCN=C(N)N)C(=O)N[C@@H](CC(O)=O)C(=O)N[C@@H](Cc1cnc[nH]1)C(=O)N[C@@H](CO)C(=O)N[C@@H](CCCN=C(N)N)C(=O)N3)C(=O)N[C@H](CC(N)=O)C(=O)N2)C(N)=O
: