Target
Protein kinase C delta type
Ligand
BDBM2683
Substrate
Meas. Tech.
ChEMBL_533618 (CHEMBL966811)
IC50
32±n/a nM
Citation
 Qi, ZHSong, MWallace, MJWang, DNewton, PMMcMahon, TChou, WHZhang, CShokat, KMMessing, RO Protein kinase C epsilon regulates gamma-aminobutyrate type A receptor sensitivity to ethanol and benzodiazepines through phosphorylation of gamma2 subunits. J Biol Chem 282:33052-63 (2007)  
Target
Name:
Protein kinase C delta type
Synonyms:
KPCD_HUMAN PKCD Protein Kinase C- delta nPKC-delta
Type:
Enzyme
Mol. Mass.:
77516.79
Organism:
Homo sapiens (Human)
Description:
The recombinant human PKC enzymes were produced using a baculovirus expression system in SF9 cells
Residue:
676
  
Inhibitor
Name:
BDBM2683
Synonyms:
2-[1-(3-dimethylaminopropyl)-indol-3-yl]-3-(indol-3-yl)maleimide BIM-1 GF 109203X | JMC526193 Compound 2
Type:
Small organic molecule
Emp. Form.:
C25H24N4O2
Mol. Mass.:
412.4837
SMILES:
CN(C)CCCn1cc(C2=C(C(=O)NC2=O)c2c[nH]c3ccccc23)c2ccccc12
: