Target
Ephrin type-B receptor 2
Ligand
BDBM50242410
Substrate
Meas. Tech.
ChEMBL_534495 (CHEMBL981909)
Kd
6000±n/a nM
Citation
 Chrencik, JEBrooun, ARecht, MINicola, GDavis, LKAbagyan, RWidmer, HPasquale, EBKuhn, P Three-dimensional structure of the EphB2 receptor in complex with an antagonistic peptide reveals a novel mode of inhibition. J Biol Chem 282:36505-13 (2007)  
Target
Name:
Ephrin type-B receptor 2
Synonyms:
DRT ELK-related tyrosine kinase EPH-like kinase 5 EPHB2_HUMAN EPTH3 Ephrin receptor TYRO5
Type:
PROTEIN
Mol. Mass.:
117491.44
Organism:
Homo sapiens (Human)
Description:
ChEMBL_1476221
Residue:
1055
  
Inhibitor
Name:
BDBM50242410
Synonyms:
CHEMBL508644 | SNEWIQPKLPQH
Type:
Small organic molecule
Emp. Form.:
C67H101N19O19
Mol. Mass.:
1476.6347
SMILES:
CC[C@H](C)[C@H](NC(=O)[C@H](Cc1c[nH]c2ccccc12)NC(=O)[C@H](CCC(O)=O)NC(=O)[C@H](CC(N)=O)NC(=O)[C@@H](N)CO)C(=O)N[C@@H](CCC(N)=O)C(=O)N1CCC[C@H]1C(=O)N[C@@H](CCCCN)C(=O)N[C@@H](CC(C)C)C(=O)N1CCC[C@H]1C(=O)N[C@@H](CCC(N)=O)C(=O)N[C@@H](Cc1cnc[nH]1)C(O)=O
: