Target
cGMP-dependent protein kinase
Ligand
BDBM50265430
Substrate
Meas. Tech.
ChEMBL_496992 (CHEMBL1005407)
IC50
0.07±n/a nM
Citation
 Scribner, ADennis, RLee, SOuvry, GPerrey, DFisher, MWyvratt, MLeavitt, PLiberator, PGurnett, ABrown, CMathew, JThompson, DSchmatz, DBiftu, T Synthesis and biological activity of imidazopyridine anticoccidial agents: Part II. Eur J Med Chem 43:1123-51 (2008)  
Target
Name:
cGMP-dependent protein kinase
Synonyms:
Type:
PROTEIN
Mol. Mass.:
112911.27
Organism:
Eimeria tenella
Description:
ChEMBL_469577
Residue:
1003
  
Inhibitor
Name:
BDBM50265430
Synonyms:
4-[2-(4-Fluorophenyl)-7-(1-phenethylpiperidin-4-yl)-imidazo[1,2-a]pyridin-3-yl]pyrimidin-2-ylamine | CHEMBL495956
Type:
Small organic molecule
Emp. Form.:
C30H29FN6
Mol. Mass.:
492.5899
SMILES:
Nc1nccc(n1)-c1c(nc2cc(ccn12)C1CCN(CCc2ccccc2)CC1)-c1ccc(F)cc1
: