Target
Cyclin-dependent kinase 2
Ligand
BDBM7157
Substrate
Meas. Tech.
ChEMBL_519498 (CHEMBL951804)
IC50
67±n/a nM
Citation
 Mascarenhas, NMGhoshal, N An efficient tool for identifying inhibitors based on 3D-QSAR and docking using feature-shape pharmacophore of biologically active conformation--a case study with CDK2/cyclinA. Eur J Med Chem 43:2807-18 (2008)  
Target
Name:
Cyclin-dependent kinase 2
Synonyms:
CDK2 CDK2_HUMAN Cell division protein kinase 2 Protein cereblon/Cyclin-dependent kinase 2 | p33 protein kinase
Type:
Enzyme Subunit
Mol. Mass.:
33938.17
Organism:
Homo sapiens (Human)
Description:
P24941
Residue:
298
  
Inhibitor
Name:
BDBM7157
Synonyms:
3-Phenylacetamidoaminopyrazole deriv. 34 CS9 N-(5-cyclopropyl-1H-pyrazol-3-yl)-2-[4-(trifluoromethoxy)phenyl]acetamide
Type:
Small organic molecule
Emp. Form.:
C15H14F3N3O2
Mol. Mass.:
325.2858
SMILES:
FC(F)(F)Oc1ccc(CC(=O)Nc2cc(n[nH]2)C2CC2)cc1
: