Target
Dipeptidyl peptidase 4
Ligand
BDBM50241053
Substrate
Meas. Tech.
ChEMBL_497335 (CHEMBL999374)
IC50
110±n/a nM
Citation
 Lu, ILTsai, KCChiang, YKJiaang, WTWu, SHMahindroo, NChien, CHLee, SJChen, XChao, YSWu, SY A three-dimensional pharmacophore model for dipeptidyl peptidase IV inhibitors. Eur J Med Chem 43:1603-11 (2008)  
Target
Name:
Dipeptidyl peptidase 4
Synonyms:
ADABP Adenosine deaminase complexing protein 2 CD_antigen=CD26 DPP4 DPPIV Dipeptidyl peptidase 4 (DPP IV) Dipeptidyl peptidase 4 (DPP4) Dipeptidyl peptidase 4 membrane form Dipeptidyl peptidase IV Dipeptidyl peptidase IV (DDP-IV) Dipeptidyl peptidase IV membrane form Dipeptidyl peptidase-IV (DPP-4) T-cell activation antigen CD26 | TP103
Type:
Enzyme
Mol. Mass.:
88271.01
Organism:
Homo sapiens (Human)
Description:
P27487
Residue:
766
  
Inhibitor
Name:
BDBM50241053
Synonyms:
(S)-2-amino-2-cyclohexyl-1-(3,3,4,4-tetrafluoropyrrolidin-1-yl)ethanone [1-(S)-1-cyclohexyl-2-oxo-(3,3,4,4,-tetrafluoropyrrolidin-1-yl)ethyl]amine
Type:
Small organic molecule
Emp. Form.:
C12H18F4N2O
Mol. Mass.:
282.2777
SMILES:
N[C@@H](C1CCCCC1)C(=O)N1CC(F)(F)C(F)(F)C1
: