Target
Dipeptidyl peptidase 4
Ligand
BDBM11696
Substrate
Meas. Tech.
ChEMBL_497335 (CHEMBL999374)
IC50
3300±n/a nM
Citation
 Lu, ILTsai, KCChiang, YKJiaang, WTWu, SHMahindroo, NChien, CHLee, SJChen, XChao, YSWu, SY A three-dimensional pharmacophore model for dipeptidyl peptidase IV inhibitors. Eur J Med Chem 43:1603-11 (2008)  
Target
Name:
Dipeptidyl peptidase 4
Synonyms:
ADABP Adenosine deaminase complexing protein 2 CD_antigen=CD26 DPP4 DPPIV Dipeptidyl peptidase 4 (DPP IV) Dipeptidyl peptidase 4 (DPP4) Dipeptidyl peptidase 4 membrane form Dipeptidyl peptidase IV Dipeptidyl peptidase IV (DDP-IV) Dipeptidyl peptidase IV membrane form Dipeptidyl peptidase-IV (DPP-4) T-cell activation antigen CD26 | TP103
Type:
Enzyme
Mol. Mass.:
88271.01
Organism:
Homo sapiens (Human)
Description:
P27487
Residue:
766
  
Inhibitor
Name:
BDBM11696
Synonyms:
(2S)-1-(2-{[2-oxo-2-(1,2,3,4-tetrahydroisoquinolin-2-yl)ethyl]amino}acetyl)pyrrolidine-2-carbonitrile 2-[2-[2-[2-Cyano-(S)-pyrrolidin-1-yl]-2-oxoethylamino]-1-oxo-ethyl]1,2,3,4-tetrahydroisoquinoline | CHEMBL371907
Type:
Small organic molecule
Emp. Form.:
C18H22N4O2
Mol. Mass.:
326.3929
SMILES:
O=C(CNCC(=O)N1CCc2ccccc2C1)N1CCC[C@H]1C#N
: