Target
Dipeptidyl peptidase 4
Ligand
BDBM50245526
Substrate
Meas. Tech.
ChEMBL_512589 (CHEMBL967900)
IC50
5900±n/a nM
Citation
 Jun, MAPark, WSKang, SKKim, KYKim, KRRhee, SDBae, MAKang, NSSohn, SKKim, SGLee, JOLee, DHCheon, HGKim, SSAhn, JH Synthesis and biological evaluation of pyrazoline analogues with beta-amino acyl group as dipeptidyl peptidase IV inhibitors. Eur J Med Chem 43:1889-902 (2008)  
Target
Name:
Dipeptidyl peptidase 4
Synonyms:
ADABP Adenosine deaminase complexing protein 2 CD_antigen=CD26 DPP4 DPPIV Dipeptidyl peptidase 4 (DPP IV) Dipeptidyl peptidase 4 (DPP4) Dipeptidyl peptidase 4 membrane form Dipeptidyl peptidase IV Dipeptidyl peptidase IV (DDP-IV) Dipeptidyl peptidase IV membrane form Dipeptidyl peptidase-IV (DPP-4) T-cell activation antigen CD26 | TP103
Type:
Enzyme
Mol. Mass.:
88271.01
Organism:
Homo sapiens (Human)
Description:
P27487
Residue:
766
  
Inhibitor
Name:
BDBM50245526
Synonyms:
(R)-4-({2-[3-Amino-4-(2,4,5-trifluorophenyl)butyryl]-3,4-dihydro-2H-pyrazole-3-carbonyl}amino)benzoic acid HCl | CHEMBL488056
Type:
Small organic molecule
Emp. Form.:
C21H19F3N4O4
Mol. Mass.:
448.3952
SMILES:
N[C@@H](CC(=O)N1N=CCC1C(=O)Nc1ccc(cc1)C(O)=O)Cc1cc(F)c(F)cc1F
: