Target
Cannabinoid receptor 1
Ligand
BDBM50242600
Substrate
Meas. Tech.
ChEMBL_534562 (CHEMBL988123)
IC50
163±n/a nM
Citation
 Song, KSLee, SHChun, HJKim, JYJung, MEAhn, KKim, SUKim, JLee, J Design, synthesis and biological evaluation of piperazine analogues as CB1 cannabinoid receptor ligands. Bioorg Med Chem 16:4035-51 (2008)  
Target
Name:
Cannabinoid receptor 1
Synonyms:
Brain-type cannabinoid receptor CB-R CNR1_RAT Cannabinoid receptor Cnr1 | Skr6
Type:
G Protein-Coupled Receptor (GPCR)
Mol. Mass.:
52856.55
Organism:
Rattus norvegicus (rat)
Description:
P20272
Residue:
473
  
Inhibitor
Name:
BDBM50242600
Synonyms:
4-((4-Chlorophenyl)(2-(trifluoromethyl)phenyl)-methyl)-N-cyclohexylpiperazine-1-carboxamide | CHEMBL488614
Type:
Small organic molecule
Emp. Form.:
C25H29ClF3N3O
Mol. Mass.:
479.965
SMILES:
FC(F)(F)c1ccccc1C(N1CCN(CC1)C(=O)NC1CCCCC1)c1ccc(Cl)cc1
: