Target
Neuronal acetylcholine receptor subunit alpha-7
Ligand
BDBM50251047
Substrate
Meas. Tech.
ChEMBL_529904 (CHEMBL971219)
IC50
177000±n/a nM
Citation
 Huang, JOrac, CMMcKay, SMcKay, DBBergmeier, SC The synthesis of 5-substituted ring E analogs of methyllycaconitine via the Suzuki-Miyaura cross-coupling reaction. Bioorg Med Chem 16:3816-24 (2008)  
Target
Name:
Neuronal acetylcholine receptor subunit alpha-7
Synonyms:
ACHA7_BOVIN | CHRNA7
Type:
PROTEIN
Mol. Mass.:
55999.74
Organism:
Bos taurus
Description:
ChEMBL_529904
Residue:
499
  
Inhibitor
Name:
BDBM50251047
Synonyms:
((R)-1-(3-phenylpropyl)piperidin-3-yl)methyl 2-(3-methyl-2,5-dioxopyrrolidin-1-yl)benzoate | CHEMBL458182
Type:
Small organic molecule
Emp. Form.:
C27H32N2O4
Mol. Mass.:
448.554
SMILES:
Cc1cc(O)n(c1O)-c1ccccc1C(=O)OC[C@@H]1CCCN(CCCc2ccccc2)C1
: