Target
Proto-oncogene tyrosine-protein kinase receptor Ret
Ligand
BDBM50266466
Substrate
Meas. Tech.
ChEMBL_543837 (CHEMBL1016027)
IC50
>10000±n/a nM
Citation
 Bouchikhi, FRossignol, ESancelme, MAboab, BAnizon, FFabbro, DPrudhomme, MMoreau, P Synthesis and biological evaluation of diversely substituted indolin-2-ones. Eur J Med Chem 43:2316-22 (2008)  
Target
Name:
Proto-oncogene tyrosine-protein kinase receptor Ret
Synonyms:
CDHF12 Cadherin family member 12 Proto-oncogene c-Ret RET51 Tyrosine-protein kinase Ret (RET)
Type:
Protein
Mol. Mass.:
124318.29
Organism:
Homo sapiens (Human)
Description:
P07949
Residue:
1114
  
Inhibitor
Name:
BDBM50266466
Synonyms:
(Z/E)-(2S)-2-amino-5-([(2-oxo-indolin-3-ylidene)methyl]amino)pentanoic acid hydrochloride | CHEMBL458352
Type:
Small organic molecule
Emp. Form.:
C14H17N3O3
Mol. Mass.:
275.3031
SMILES:
N[C@@H](CCCN=CC1C(=O)Nc2ccccc12)C(O)=O
: