Target
Transient receptor potential cation channel subfamily V member 1
Ligand
BDBM20557
Substrate
Meas. Tech.
ChEMBL_532535 (CHEMBL976971)
IC50
0.900000±n/a nM
Citation
 Tamayo, NLiao, HStec, MMWang, XChakrabarti, PRetz, DDoherty, EMSurapaneni, STamir, RBannon, AWGavva, NRNorman, MH Design and synthesis of peripherally restricted transient receptor potential vanilloid 1 (TRPV1) antagonists. J Med Chem 51:2744-57 (2008)  
Target
Name:
Transient receptor potential cation channel subfamily V member 1
Synonyms:
Capsaicin receptor TRPV1_RAT Trpv1 Vanilloid VR1 Vanilloid receptor 1 (VRI/TRPV1) Vanilloid receptor type 1-like (TrpV1/Vr1) Vr1l | osm-9-like TRP channel 1
Type:
Transient Receptor
Mol. Mass.:
94956.12
Organism:
Rattus norvegicus (rat)
Description:
O35433
Residue:
838
  
Inhibitor
Name:
BDBM20557
Synonyms:
AMG 517 JMC503515 Compound 23 US8796328, A | US8802711, H
Type:
Small organic molecule
Emp. Form.:
C20H13F3N4O2S
Mol. Mass.:
430.403
SMILES:
CC(=O)Nc1nc2c(Oc3cc(ncn3)-c3ccc(cc3)C(F)(F)F)cccc2s1
: